Reaction Details
Target5-hydroxytryptamine receptor 1A
LigandBDBM50231636
Substrate/Competitorn/a
Meas. Tech.ChEBML_1513
Ki 37±n/a nM
Citation Agarwal, APearson, PPTaylor, EWLi, HBDahlgren, THerslöf, MYang, YLambert, GNelson, DLRegan, JW Three-dimensional quantitative structure-activity relationships of 5-HT receptor binding data for tetrahydropyridinylindole derivatives: a comparison of the Hansch and CoMFA methods. J Med Chem36:4006-14 (1993) 
 
5-hydroxytryptamine receptor 1A
Name:5-hydroxytryptamine receptor 1A
Type:G Protein-Coupled Receptor (GPCR)
Mol. Mass.:46445.29
Organism:Rattus norvegicus (rat)
Description:Binding assays were performed using rat hippocampal membranes.
Residue:422
BDBM50231636
NameBDBM50231636
Synonyms:CHEMBL287097
TypeSmall organic molecule
Emp. Form.C18H23N3O
Mol. Mass.297.3947
SMILESCCCN1CCC(=CC1)c1c[nH]c2ccc(NC(C)=O)cc12