Reaction Details
Target5-hydroxytryptamine receptor 1A
LigandBDBM50015718
Substrate/Competitorn/a
Meas. Tech.ChEBML_1513
Ki 65±n/a nM
Citation Agarwal, APearson, PPTaylor, EWLi, HBDahlgren, THerslöf, MYang, YLambert, GNelson, DLRegan, JW Three-dimensional quantitative structure-activity relationships of 5-HT receptor binding data for tetrahydropyridinylindole derivatives: a comparison of the Hansch and CoMFA methods. J Med Chem36:4006-14 (1993) 
 
5-hydroxytryptamine receptor 1A
Name:5-hydroxytryptamine receptor 1A
Type:G Protein-Coupled Receptor (GPCR)
Mol. Mass.:46445.29
Organism:Rattus norvegicus (rat)
Description:Binding assays were performed using rat hippocampal membranes.
Residue:422
BDBM50015718
NameBDBM50015718
Synonyms:5-Nitro-3-(1,2,3,6-tetrahydro-pyridin-4-yl)-1H-indole | CHEMBL283257
TypeSmall organic molecule
Emp. Form.C13H13N3O2
Mol. Mass.243.2612
SMILES[O-][N+](=O)c1ccc2[nH]cc(C3=CCNCC3)c2c1