Reaction Details
TargetSerotonin 2 (5-HT2) receptor
LigandBDBM50158037
Substrate/Competitorn/a
Meas. Tech.ChEMBL_2187 (CHEMBL617013)
Ki 15±n/a nM
Citation Agarwal, APearson, PPTaylor, EWLi, HBDahlgren, THerslöf, MYang, YLambert, GNelson, DLRegan, JW Three-dimensional quantitative structure-activity relationships of 5-HT receptor binding data for tetrahydropyridinylindole derivatives: a comparison of the Hansch and CoMFA methods. J Med Chem36:4006-14 (1993) 
 
Serotonin 2 (5-HT2) receptor
Name:Serotonin 2 (5-HT2) receptor
Synonyms:5-hydroxytryptamine receptor 2A/2B/2C
Type:n/a
Mol. Mass.:n/a
Description:ASSAY_ID of ChEMBL is 2197419
Components:This complex has 3 components.
Component 1
Name:5-hydroxytryptamine receptor 2B
Type:Enzyme Catalytic Domain
Mol. Mass.:53668.47
Organism:RAT
Description:5-HT2B HTR2B RAT::P30994
Residue:479
Component 2
Name:5-hydroxytryptamine receptor 2C
Synonyms:5-HT2C 5-hydroxytryptamine receptor 2C (5HT2c) 5ht1c Htr2c Serotonin receptor 2a and 2c (5HT2A and 5HT2C)
Type:Enzyme
Mol. Mass.:51935.10
Organism:Rattus norvegicus (Rat)
Description:P08909
Residue:460
Component 3
Name:5-hydroxytryptamine receptor 2A
Synonyms:5-HT-2A 5-HT2A 5-hydroxytryptamine receptor 2A (5HT2A) Htr2 Serotonin Receptor 2A
Type:G Protein-Coupled Receptor (GPCR)
Mol. Mass.:52852.05
Organism:Rattus norvegicus (rat)
Description:Rat cortex membranes 5-HT2A receptors.
Residue:471
BDBM50158037
NameBDBM50158037
Synonyms:1-Benzyl-3-(1-methyl-1,2,3,6-tetrahydro-pyridin-4-yl)-1H-indole | CHEMBL281937
TypeSmall organic molecule
Emp. Form.C21H22N2
Mol. Mass.302.4128
SMILESCN1CCC(=CC1)c1cn(Cc2ccccc2)c2ccccc12