Reaction Details
TargetKappa-type opioid receptor
LigandBDBM50007981
Substrate/Competitorn/a
Meas. Tech.ChEBML_1643868
IC50 50±n/a nM
Citation Chen, SRKe, YYYeh, TKLin, SYOu, LCChen, SCChang, WTChang, HFWu, ZHHsieh, CCLaw, PYLoh, HHShih, CLai, YKYeh, SHUeng, SH Discovery, structure-activity relationship studies, and anti-nociceptive effects of N-(1,2,3,4-tetrahydro-1-isoquinolinylmethyl)benzamides as novel opioid receptor agonists. Eur J Med Chem126:202-217 (2017) 
 
Kappa-type opioid receptor
Name:Kappa-type opioid receptor
Type:G Protein-Coupled Receptor (GPCR)
Mol. Mass.:42648.76
Organism:Homo sapiens (Human)
Description:P41145
Residue:380
BDBM50007981
NameBDBM50007981
Synonyms:CHEMBL4100317
TypeSmall organic molecule
Emp. Form.C18H20N2O2
Mol. Mass.296.3636
SMILESCOc1ccc(cc1)C(=O)NCC1NCCc2ccccc12