Reaction Details
TargetKappa-type opioid receptor
LigandBDBM50003238
Substrate/Competitorn/a
Meas. Tech.ChEBML_1643868
IC50 260±n/a nM
Citation Chen, SRKe, YYYeh, TKLin, SYOu, LCChen, SCChang, WTChang, HFWu, ZHHsieh, CCLaw, PYLoh, HHShih, CLai, YKYeh, SHUeng, SH Discovery, structure-activity relationship studies, and anti-nociceptive effects of N-(1,2,3,4-tetrahydro-1-isoquinolinylmethyl)benzamides as novel opioid receptor agonists. Eur J Med Chem126:202-217 (2017) 
 
Kappa-type opioid receptor
Name:Kappa-type opioid receptor
Type:G Protein-Coupled Receptor (GPCR)
Mol. Mass.:42648.76
Organism:Homo sapiens (Human)
Description:P41145
Residue:380
BDBM50003238
NameBDBM50003238
Synonyms:CHEMBL4082299
TypeSmall organic molecule
Emp. Form.C18H17F3N2O2
Mol. Mass.350.335
SMILESFC(F)(F)Oc1ccc(cc1)C(=O)NCC1NCCc2ccccc12