Reaction Details
TargetKappa-type opioid receptor
LigandBDBM50008003
Substrate/Competitorn/a
Meas. Tech.ChEBML_1643868
IC50 810±n/a nM
Citation Chen, SRKe, YYYeh, TKLin, SYOu, LCChen, SCChang, WTChang, HFWu, ZHHsieh, CCLaw, PYLoh, HHShih, CLai, YKYeh, SHUeng, SH Discovery, structure-activity relationship studies, and anti-nociceptive effects of N-(1,2,3,4-tetrahydro-1-isoquinolinylmethyl)benzamides as novel opioid receptor agonists. Eur J Med Chem126:202-217 (2017) 
 
Kappa-type opioid receptor
Name:Kappa-type opioid receptor
Type:G Protein-Coupled Receptor (GPCR)
Mol. Mass.:42648.76
Organism:Homo sapiens (Human)
Description:P41145
Residue:380
BDBM50008003
NameBDBM50008003
Synonyms:CHEMBL4065924
TypeSmall organic molecule
Emp. Form.C17H16Cl2N2O
Mol. Mass.335.228
SMILESClc1ccc(cc1Cl)C(=O)NCC1NCCc2ccccc12