Reaction Details
TargetMu-type opioid receptor
LigandBDBM50013629
Substrate/Competitorn/a
Meas. Tech.ChEMBL_1643864 (CHEMBL3992793)
EC50 540±n/a nM
Citation Chen, SRKe, YYYeh, TKLin, SYOu, LCChen, SCChang, WTChang, HFWu, ZHHsieh, CCLaw, PYLoh, HHShih, CLai, YKYeh, SHUeng, SH Discovery, structure-activity relationship studies, and anti-nociceptive effects of N-(1,2,3,4-tetrahydro-1-isoquinolinylmethyl)benzamides as novel opioid receptor agonists. Eur J Med Chem126:202-217 (2017) 
 
Mu-type opioid receptor
Name:Mu-type opioid receptor
Type:G Protein-Coupled Receptor (GPCR)
Mol. Mass.:44789.51
Organism:Homo sapiens (Human)
Description:P35372
Residue:400
BDBM50013629
NameBDBM50013629
Synonyms:CHEMBL4062124
TypeSmall organic molecule
Emp. Form.C17H17FN2O
Mol. Mass.284.3281
SMILESFc1ccc(cc1)C(=O)NCC1NCCc2ccccc12