Reaction Details
TargetMu-type opioid receptor
LigandBDBM50008003
Substrate/Competitorn/a
Meas. Tech.ChEMBL_1643866 (CHEMBL3992795)
IC50 230±n/a nM
Citation Chen, SRKe, YYYeh, TKLin, SYOu, LCChen, SCChang, WTChang, HFWu, ZHHsieh, CCLaw, PYLoh, HHShih, CLai, YKYeh, SHUeng, SH Discovery, structure-activity relationship studies, and anti-nociceptive effects of N-(1,2,3,4-tetrahydro-1-isoquinolinylmethyl)benzamides as novel opioid receptor agonists. Eur J Med Chem126:202-217 (2017) 
 
Mu-type opioid receptor
Name:Mu-type opioid receptor
Type:G Protein-Coupled Receptor (GPCR)
Mol. Mass.:44789.51
Organism:Homo sapiens (Human)
Description:P35372
Residue:400
BDBM50008003
NameBDBM50008003
Synonyms:CHEMBL4065924
TypeSmall organic molecule
Emp. Form.C17H16Cl2N2O
Mol. Mass.335.228
SMILESClc1ccc(cc1Cl)C(=O)NCC1NCCc2ccccc12