Reaction Details
TargetKappa-type opioid receptor
LigandBDBM50042064
Substrate/Competitorn/a
Meas. Tech.ChEMBL_1643868 (CHEMBL3992797)
IC50 140±n/a nM
Citation Chen, SRKe, YYYeh, TKLin, SYOu, LCChen, SCChang, WTChang, HFWu, ZHHsieh, CCLaw, PYLoh, HHShih, CLai, YKYeh, SHUeng, SH Discovery, structure-activity relationship studies, and anti-nociceptive effects of N-(1,2,3,4-tetrahydro-1-isoquinolinylmethyl)benzamides as novel opioid receptor agonists. Eur J Med Chem126:202-217 (2017) 
 
Kappa-type opioid receptor
Name:Kappa-type opioid receptor
Type:G Protein-Coupled Receptor (GPCR)
Mol. Mass.:42648.76
Organism:Homo sapiens (Human)
Description:P41145
Residue:380
BDBM50042064
NameBDBM50042064
Synonyms:CHEMBL4097466
TypeSmall organic molecule
Emp. Form.C19H22N2O
Mol. Mass.294.3908
SMILESCN1CCc2ccccc2C1CNC(=O)c1ccc(C)cc1