Reaction Details
TargetCarbonic anhydrase 12
LigandBDBM50226748
Substrate/Competitorn/a
Meas. Tech.ChEMBL_1643900 (CHEMBL3992829)
Ki 1.7±n/a nM
Citation van Kuijk, SJAParvathaneni, NKNiemans, Rvan Gisbergen, MWCarta, FVullo, DPastorekova, SYaromina, ASupuran, CTDubois, LJWinum, JYLambin, P New approach of delivering cytotoxic drugs towards CAIX expressing cells: A concept of dual-target drugs. Eur J Med Chem127:691-702 (2017) 
 
Carbonic anhydrase 12
Name:Carbonic anhydrase 12
Type:Enzyme
Mol. Mass.:39456.00
Organism:Homo sapiens (Human)
Description:Catalytic domain of human cloned isozyme was used in the assay
Residue:354
BDBM50226748
NameBDBM50226748
Synonyms:CHEMBL4080055
TypeSmall organic molecule
Emp. Form.C10H17ClN6O2S
Mol. Mass.320.799
SMILESCl.NC(=N)NC(=N)NCCc1ccc(cc1)S(N)(=O)=O