Reaction Details
TargetCarbonic anhydrase 2
LigandBDBM50227244
Substrate/Competitorn/a
Meas. Tech.ChEMBL_1643898 (CHEMBL3992827)
Ki 7.1±n/a nM
Citation van Kuijk, SJAParvathaneni, NKNiemans, Rvan Gisbergen, MWCarta, FVullo, DPastorekova, SYaromina, ASupuran, CTDubois, LJWinum, JYLambin, P New approach of delivering cytotoxic drugs towards CAIX expressing cells: A concept of dual-target drugs. Eur J Med Chem127:691-702 (2017) 
 
Carbonic anhydrase 2
Name:Carbonic anhydrase 2
Type:Enzyme
Mol. Mass.:29250.71
Organism:Homo sapiens (Human)
Description:P00918
Residue:260
BDBM50227244
NameBDBM50227244
Synonyms:CHEMBL4096322
TypeSmall organic molecule
Emp. Form.C15H15N5O4S
Mol. Mass.361.376
SMILESNS(=O)(=O)c1ccc(CCNc2n[n+]([O-])c3ccccc3[n+]2[O-])cc1