Reaction Details
TargetCarbonic anhydrase 2
LigandBDBM50226809
Substrate/Competitorn/a
Meas. Tech.ChEMBL_1643898 (CHEMBL3992827)
Ki 9.2±n/a nM
Citation van Kuijk, SJAParvathaneni, NKNiemans, Rvan Gisbergen, MWCarta, FVullo, DPastorekova, SYaromina, ASupuran, CTDubois, LJWinum, JYLambin, P New approach of delivering cytotoxic drugs towards CAIX expressing cells: A concept of dual-target drugs. Eur J Med Chem127:691-702 (2017) 
 
Carbonic anhydrase 2
Name:Carbonic anhydrase 2
Type:Enzyme
Mol. Mass.:29250.71
Organism:Homo sapiens (Human)
Description:P00918
Residue:260
BDBM50226809
NameBDBM50226809
Synonyms:CHEMBL4075724
TypeSmall organic molecule
Emp. Form.C14H15N7O4S
Mol. Mass.377.378
SMILESCn1nnc2c(ncn2c1=O)C(=O)NCCc1ccc(cc1)S(N)(=O)=O