Reaction Details
TargetReceptor-interacting serine/threonine-protein kinase 1
LigandBDBM50229025
Substrate/Competitorn/a
Meas. Tech.ChEMBL_1644185 (CHEMBL3993114)
IC50 13±n/a nM
Citation Ren, YSu, YSun, LHe, SMeng, LLiao, DLiu, XMa, YLiu, CLi, SRuan, HLei, XWang, XZhang, Z Discovery of a Highly Potent, Selective, and Metabolically Stable Inhibitor of Receptor-Interacting Protein 1 (RIP1) for the Treatment of Systemic Inflammatory Response Syndrome. J Med Chem60:972-986 (2017) 
 
Receptor-interacting serine/threonine-protein kinase 1
Name:Receptor-interacting serine/threonine-protein kinase 1
Type:Enzyme Catalytic Domain
Mol. Mass.:75926.99
Organism:Homo sapiens (Human)
Description:Q13546
Residue:671
BDBM50229025
NameBDBM50229025
Synonyms:CHEMBL4092421
TypeSmall organic molecule
Emp. Form.C13H19NO2
Mol. Mass.221.2955
SMILESCCC(C)(C)C(=O)N(O)Cc1ccccc1