Reaction Details
TargetSerine/threonine-protein kinase pim-1
LigandBDBM50364792
Substrate/Competitorn/a
Meas. Tech.ChEMBL_1644276 (CHEMBL3993205)
IC50 155±n/a nM
Citation Hu, YStumpfe, DBajorath, J Recent Advances in Scaffold Hopping. J Med Chem60:1238-1246 (2017) 
 
Serine/threonine-protein kinase pim-1
Name:Serine/threonine-protein kinase pim-1
Type:Protein
Mol. Mass.:35681.82
Organism:Homo sapiens (Human)
Description:P11309
Residue:313
BDBM50364792
NameBDBM50364792
Synonyms:CHEMBL1952112
TypeSmall organic molecule
Emp. Form.C19H21F3N6O
Mol. Mass.406.4048
SMILESCN1CCC(CNc2ccc3nnn(-c4cccc(OC(F)(F)F)c4)c3n2)CC1