Reaction Details
TargetVasopressin V1a receptor
LigandBDBM50077460
Substrate/Competitorn/a
Meas. Tech.ChEMBL_1644277 (CHEMBL3993206)
Ki 295±n/a nM
Citation Hu, YStumpfe, DBajorath, J Recent Advances in Scaffold Hopping. J Med Chem60:1238-1246 (2017) 
 
Vasopressin V1a receptor
Name:Vasopressin V1a receptor
Type:Receptor
Mol. Mass.:46820.18
Organism:Homo sapiens (Human)
Description:P37288
Residue:418
BDBM50077460
NameBDBM50077460
Synonyms:CHEMBL3416864
TypeSmall organic molecule
Emp. Form.C29H30N2O2
Mol. Mass.438.5607
SMILESCc1c(C(=O)N2CCC(O)(Cc3ccccc3)CC2)c2ccccc2n1Cc1ccccc1