Reaction Details
TargetOrexin/Hypocretin receptor type 1
LigandBDBM50230035
Substrate/Competitorn/a
Meas. Tech.ChEBML_1644403
Ki 1.4±n/a nM
Citation Nagase, HYamamoto, NYata, MOhrui, SOkada, TSaitoh, TKutsumura, NNagumo, YIrukayama-Tomobe, YIshikawa, YOgawa, YHirayama, SKuroda, DWatanabe, YGouda, HYanagisawa, M Design and Synthesis of Potent and Highly Selective Orexin 1 Receptor Antagonists with a Morphinan Skeleton and Their Pharmacologies. J Med Chem60:1018-1040 (2017) 
 
Orexin/Hypocretin receptor type 1
Name:Orexin/Hypocretin receptor type 1
Type:Protein
Mol. Mass.:47554.50
Organism:Homo sapiens (Human)
Description:O43613
Residue:425
BDBM50230035
NameBDBM50230035
Synonyms:CHEMBL4091544
TypeSmall organic molecule
Emp. Form.C34H38N4O6S
Mol. Mass.630.754
SMILES[H][C@@]12Oc3c4c(C[C@@]5([H])N(CC[C@@]14[C@@]5(O)CC[C@H]2N(C)C(=O)\C=C\c1ccccn1)S(=O)(=O)c1ccccc1N(C)C)ccc3OC