Reaction Details
TargetMu-type opioid receptor
LigandBDBM50274347
Substrate/Competitorn/a
Meas. Tech.ChEBML_1644402
Ki 6.0±n/a nM
Citation Nagase, HYamamoto, NYata, MOhrui, SOkada, TSaitoh, TKutsumura, NNagumo, YIrukayama-Tomobe, YIshikawa, YOgawa, YHirayama, SKuroda, DWatanabe, YGouda, HYanagisawa, M Design and Synthesis of Potent and Highly Selective Orexin 1 Receptor Antagonists with a Morphinan Skeleton and Their Pharmacologies. J Med Chem60:1018-1040 (2017) 
 
Mu-type opioid receptor
Name:Mu-type opioid receptor
Type:G Protein-Coupled Receptor (GPCR)
Mol. Mass.:44789.51
Organism:Homo sapiens (Human)
Description:P35372
Residue:400
BDBM50274347
NameBDBM50274347
Synonyms:(2E)-N-[(5R,6R)-17-(cyclopropylmethyl)-4,5-epoxy-3,14-dihydroxymorphinan-6-yl]-3-(furan-3-yl)-N-methylprop-2-enamide hydrochloride US10377763, Example 1
TypeSmall organic molecule
Emp. Form.C28H32N2O5
Mol. Mass.476.5641
SMILESCN([C@@H]1CC[C@@]2(O)[C@H]3Cc4ccc(O)c5O[C@@H]1[C@]2(CCN3CC1CC1)c45)C(=O)\C=C\c1ccoc1