Reaction Details
TargetOrexin/Hypocretin receptor type 1
LigandBDBM50230154
Substrate/Competitorn/a
Meas. Tech.ChEMBL_1644403 (CHEMBL3993332)
Ki 7.6±n/a nM
Citation Nagase, HYamamoto, NYata, MOhrui, SOkada, TSaitoh, TKutsumura, NNagumo, YIrukayama-Tomobe, YIshikawa, YOgawa, YHirayama, SKuroda, DWatanabe, YGouda, HYanagisawa, M Design and Synthesis of Potent and Highly Selective Orexin 1 Receptor Antagonists with a Morphinan Skeleton and Their Pharmacologies. J Med Chem60:1018-1040 (2017) 
 
Orexin/Hypocretin receptor type 1
Name:Orexin/Hypocretin receptor type 1
Type:Protein
Mol. Mass.:47554.50
Organism:Homo sapiens (Human)
Description:O43613
Residue:425
BDBM50230154
NameBDBM50230154
Synonyms:CHEMBL4097196 | US10377763, Example 15
TypeSmall organic molecule
Emp. Form.C31H31FN2O7S
Mol. Mass.594.65
SMILES[H][C@@]12Oc3c4c(C[C@@]5([H])N(CC[C@@]14[C@@]5(O)CC[C@H]2N(C)C(=O)\C=C\c1ccoc1)S(=O)(=O)c1cccc(F)c1)ccc3OC