Reaction Details
TargetEphrin type-B receptor 4
LigandBDBM50230170
Substrate/Competitorn/a
Meas. Tech.ChEBML_1644612
IC50 0.130000±n/a nM
Citation Zhang, LShan, YLi, CSun, YSu, PWang, JLi, LPan, XZhang, J Discovery of novel anti-angiogenesis agents. Part 6: Multi-targeted RTK inhibitors. Eur J Med Chem127:275-285 (2017) 
 
Ephrin type-B receptor 4
Name:Ephrin type-B receptor 4
Type:Enzyme
Mol. Mass.:108273.51
Organism:Homo sapiens (Human)
Description:P54760
Residue:987
BDBM50230170
NameBDBM50230170
Synonyms:CHEMBL4100979
TypeSmall organic molecule
Emp. Form.C24H19F2N5O2
Mol. Mass.447.4368
SMILESNc1n[nH]c2cccc(-c3ccc(NC(=O)C4(CC4)C(=O)Nc4ccc(F)c(F)c4)cc3)c12