Reaction Details
TargetCarbonic anhydrase 2
LigandBDBM50230205
Substrate/Competitorn/a
Meas. Tech.ChEMBL_1644696 (CHEMBL3993625)
Ki>100±n/a nM
Citation Bua, SDi Cesare Mannelli, LVullo, DGhelardini, CBartolucci, GScozzafava, ASupuran, CTCarta, F Design and Synthesis of Novel Nonsteroidal Anti-Inflammatory Drugs and Carbonic Anhydrase Inhibitors Hybrids (NSAIDs-CAIs) for the Treatment of Rheumatoid Arthritis. J Med Chem60:1159-1170 (2017) 
 
Carbonic anhydrase 2
Name:Carbonic anhydrase 2
Type:Enzyme
Mol. Mass.:29250.71
Organism:Homo sapiens (Human)
Description:P00918
Residue:260
BDBM50230205
NameBDBM50230205
Synonyms:CHEMBL4088636
TypeSmall organic molecule
Emp. Form.C25H23NO5
Mol. Mass.417.4538
SMILESCOc1ccc2cc(ccc2c1)[C@H](C)C(=O)NCCOc1ccc2oc(=O)ccc2c1