Reaction Details
TargetCarbonic anhydrase 4
LigandBDBM50230201
Substrate/Competitorn/a
Meas. Tech.ChEMBL_1644697 (CHEMBL3993626)
Ki 9.1±n/a nM
Citation Bua, SDi Cesare Mannelli, LVullo, DGhelardini, CBartolucci, GScozzafava, ASupuran, CTCarta, F Design and Synthesis of Novel Nonsteroidal Anti-Inflammatory Drugs and Carbonic Anhydrase Inhibitors Hybrids (NSAIDs-CAIs) for the Treatment of Rheumatoid Arthritis. J Med Chem60:1159-1170 (2017) 
 
Carbonic anhydrase 4
Name:Carbonic anhydrase 4
Type:Enzyme
Mol. Mass.:35037.98
Organism:Homo sapiens (Human)
Description:P22748
Residue:312
BDBM50230201
NameBDBM50230201
Synonyms:CHEMBL4103176
TypeSmall organic molecule
Emp. Form.C25H20Cl2N2O4
Mol. Mass.483.343
SMILESClc1cccc(Cl)c1Nc1ccccc1CC(=O)NCCOc1ccc2ccc(=O)oc2c1