Reaction Details
TargetCarbonic anhydrase 7
LigandBDBM50230205
Substrate/Competitorn/a
Meas. Tech.ChEMBL_1644698 (CHEMBL3993627)
Ki>100±n/a nM
Citation Bua, SDi Cesare Mannelli, LVullo, DGhelardini, CBartolucci, GScozzafava, ASupuran, CTCarta, F Design and Synthesis of Novel Nonsteroidal Anti-Inflammatory Drugs and Carbonic Anhydrase Inhibitors Hybrids (NSAIDs-CAIs) for the Treatment of Rheumatoid Arthritis. J Med Chem60:1159-1170 (2017) 
 
Carbonic anhydrase 7
Name:Carbonic anhydrase 7
Type:Enzyme
Mol. Mass.:29664.11
Organism:Homo sapiens (Human)
Description:Human cloned isozyme.
Residue:264
BDBM50230205
NameBDBM50230205
Synonyms:CHEMBL4088636
TypeSmall organic molecule
Emp. Form.C25H23NO5
Mol. Mass.417.4538
SMILESCOc1ccc2cc(ccc2c1)[C@H](C)C(=O)NCCOc1ccc2oc(=O)ccc2c1