Reaction Details
TargetCarbonic anhydrase 9
LigandBDBM50230194
Substrate/Competitorn/a
Meas. Tech.ChEMBL_1644699 (CHEMBL3993628)
Ki 55±n/a nM
Citation Bua, SDi Cesare Mannelli, LVullo, DGhelardini, CBartolucci, GScozzafava, ASupuran, CTCarta, F Design and Synthesis of Novel Nonsteroidal Anti-Inflammatory Drugs and Carbonic Anhydrase Inhibitors Hybrids (NSAIDs-CAIs) for the Treatment of Rheumatoid Arthritis. J Med Chem60:1159-1170 (2017) 
 
Carbonic anhydrase 9
Name:Carbonic anhydrase 9
Type:Enzyme
Mol. Mass.:49669.03
Organism:Homo sapiens (Human)
Description:Catalytic domain of human cloned isozyme was used in the assay
Residue:459
BDBM50230194
NameBDBM50230194
Synonyms:CHEMBL4082922
TypeSmall organic molecule
Emp. Form.C27H23NO5
Mol. Mass.441.4752
SMILESCC(C(=O)NCCOc1ccc2oc(=O)ccc2c1)c1cccc(c1)C(=O)c1ccccc1