Reaction Details
TargetCarbonic anhydrase 12
LigandBDBM50230195
Substrate/Competitorn/a
Meas. Tech.ChEMBL_1644700 (CHEMBL3993629)
Ki>100±n/a nM
Citation Bua, SDi Cesare Mannelli, LVullo, DGhelardini, CBartolucci, GScozzafava, ASupuran, CTCarta, F Design and Synthesis of Novel Nonsteroidal Anti-Inflammatory Drugs and Carbonic Anhydrase Inhibitors Hybrids (NSAIDs-CAIs) for the Treatment of Rheumatoid Arthritis. J Med Chem60:1159-1170 (2017) 
 
Carbonic anhydrase 12
Name:Carbonic anhydrase 12
Type:Enzyme
Mol. Mass.:39456.00
Organism:Homo sapiens (Human)
Description:Catalytic domain of human cloned isozyme was used in the assay
Residue:354
BDBM50230195
NameBDBM50230195
Synonyms:CHEMBL4100903
TypeSmall organic molecule
Emp. Form.C24H27NO4
Mol. Mass.393.4755
SMILESCC(C)Cc1ccc(cc1)C(C)C(=O)NCCOc1ccc2oc(=O)ccc2c1