Reaction Details
TargetPeptidyl-prolyl cis-trans isomerase A
LigandBDBM50230213
Substrate/Competitorn/a
Meas. Tech.ChEMBL_1644714 (CHEMBL3993643)
Kd 64±n/a nM
Citation Steadman, VAPettit, SBPoullennec, KGLazarides, LKeats, AJDean, DKStanway, SJAustin, CASanvoisin, JAWatt, GMFliri, HGLiclican, ACJin, DWong, MHLeavitt, SALee, YJTian, YFrey, CRAppleby, TCSchmitz, UJansa, PMackman, RLSchultz, BE Discovery of Potent Cyclophilin Inhibitors Based on the Structural Simplification of Sanglifehrin A. J Med Chem60:1000-1017 (2017) 
 
Peptidyl-prolyl cis-trans isomerase A
Name:Peptidyl-prolyl cis-trans isomerase A
Type:Protein
Mol. Mass.:18015.32
Organism:Homo sapiens (Human)
Description:P62937
Residue:165
BDBM50230213
NameBDBM50230213
Synonyms:CHEMBL4092526
TypeSmall organic molecule
Emp. Form.C35H46N4O7
Mol. Mass.634.7623
SMILESCO[C@@H]1CC\C=C\c2cccc(COC(=O)[C@@H]3CCCN(N3)C(=O)[C@H](Cc3cccc(O)c3)NC(=O)[C@@H](NC(=O)[C@@H]1C)C(C)C)c2