Reaction Details
TargetProto-oncogene tyrosine-protein kinase Src
LigandBDBM50230317
Substrate/Competitorn/a
Meas. Tech.ChEMBL_1644759 (CHEMBL3993688)
Ki 500±n/a nM
Citation Musumeci, FFallacara, ALBrullo, CGrossi, GBotta, LCalandro, PChiariello, MKissova, MCrespan, EMaga, GSchenone, S Identification of new pyrrolo[2,3-d]pyrimidines as Src tyrosine kinase inhibitors in vitro active against Glioblastoma. Eur J Med Chem127:369-378 (2017) 
 
Proto-oncogene tyrosine-protein kinase Src
Name:Proto-oncogene tyrosine-protein kinase Src
Type:Protein
Mol. Mass.:59838.60
Organism:Homo sapiens (Human)
Description:P12931
Residue:536
BDBM50230317
NameBDBM50230317
Synonyms:CHEMBL4091022
TypeSmall organic molecule
Emp. Form.C21H19FN4S
Mol. Mass.378.466
SMILESCSc1nc(NCc2ccccc2)c2ccn(Cc3ccc(F)cc3)c2n1