Reaction Details
TargetCoagulation factor XI
LigandBDBM50230325
Substrate/Competitorn/a
Meas. Tech.ChEBML_1644767
Ki 0.470000±n/a nM
Citation Corte, JRFang, TOsuna, HPinto, DJRossi, KAMyers, JESheriff, SLou, ZZheng, JJHarper, TWBozarth, JMWu, YLuettgen, JMSeiffert, DADecicco, CPWexler, RRQuan, ML Structure-Based Design of Macrocyclic Factor XIa Inhibitors: Discovery of the Macrocyclic Amide Linker. J Med Chem60:1060-1075 (2017) 
 
Coagulation factor XI
Name:Coagulation factor XI
Type:Enzyme
Mol. Mass.:70130.58
Organism:Homo sapiens (Human)
Description:P03951
Residue:625
BDBM50230325
NameBDBM50230325
Synonyms:CHEMBL4062923
TypeSmall organic molecule
Emp. Form.C28H27Cl2N9O4
Mol. Mass.624.478
SMILESCOC(=O)Nc1ccc2-c3nc([nH]c3Cl)[C@H](CCCCCC(=O)Nc2c1)NC(=O)\C=C\c1cc(Cl)ccc1-n1cnnn1