Reaction Details
TargetProthrombin
LigandBDBM50230322
Substrate/Competitorn/a
Meas. Tech.ChEBML_1644775
Ki>11500±n/a nM
Citation Corte, JRFang, TOsuna, HPinto, DJRossi, KAMyers, JESheriff, SLou, ZZheng, JJHarper, TWBozarth, JMWu, YLuettgen, JMSeiffert, DADecicco, CPWexler, RRQuan, ML Structure-Based Design of Macrocyclic Factor XIa Inhibitors: Discovery of the Macrocyclic Amide Linker. J Med Chem60:1060-1075 (2017) 
 
Prothrombin
Name:Prothrombin
Type:Protein
Mol. Mass.:70029.57
Organism:Homo sapiens (Human)
Description:P00734
Residue:622
BDBM50230322
NameBDBM50230322
Synonyms:CHEMBL4071545
TypeSmall organic molecule
Emp. Form.C28H26ClN9O4
Mol. Mass.588.017
SMILESCOC(=O)Nc1ccc2-c3c[nH]c(n3)[C@H](C\C=C\CCC(=O)Nc2c1)NC(=O)\C=C\c1cc(Cl)ccc1-n1cnnn1