Reaction Details
TargetCoagulation factor XI
LigandBDBM50230333
Substrate/Competitorn/a
Meas. Tech.ChEBML_1644767
Ki 184±n/a nM
Citation Corte, JRFang, TOsuna, HPinto, DJRossi, KAMyers, JESheriff, SLou, ZZheng, JJHarper, TWBozarth, JMWu, YLuettgen, JMSeiffert, DADecicco, CPWexler, RRQuan, ML Structure-Based Design of Macrocyclic Factor XIa Inhibitors: Discovery of the Macrocyclic Amide Linker. J Med Chem60:1060-1075 (2017) 
 
Coagulation factor XI
Name:Coagulation factor XI
Type:Enzyme
Mol. Mass.:70130.58
Organism:Homo sapiens (Human)
Description:P03951
Residue:625
BDBM50230333
NameBDBM50230333
Synonyms:CHEMBL4104659
TypeSmall organic molecule
Emp. Form.C29H29ClN8O3
Mol. Mass.573.045
SMILESCOC(=O)Nc1ccc2-c3c[nH]c(n3)[C@H](C\C=C\CCCCc2c1)NC(=O)\C=C\c1cc(Cl)ccc1-n1cnnn1