Reaction Details
TargetProthrombin
LigandBDBM50063669
Substrate/Competitorn/a
Meas. Tech.ChEMBL_1644775 (CHEMBL3993704)
Ki>11500±n/a nM
Citation Corte, JRFang, TOsuna, HPinto, DJRossi, KAMyers, JESheriff, SLou, ZZheng, JJHarper, TWBozarth, JMWu, YLuettgen, JMSeiffert, DADecicco, CPWexler, RRQuan, ML Structure-Based Design of Macrocyclic Factor XIa Inhibitors: Discovery of the Macrocyclic Amide Linker. J Med Chem60:1060-1075 (2017) 
 
Prothrombin
Name:Prothrombin
Type:Protein
Mol. Mass.:70029.57
Organism:Homo sapiens (Human)
Description:P00734
Residue:622
BDBM50063669
NameBDBM50063669
Synonyms:CHEMBL3398641
TypeSmall organic molecule
Emp. Form.C29H24Cl2N8O3
Mol. Mass.603.459
SMILESCOC(=O)Nc1ccc(cc1)-c1nc([nH]c1Cl)[C@H](Cc1ccccc1)NC(=O)\C=C\c1cc(Cl)ccc1-n1cnnn1