Reaction Details
TargetCannabinoid receptor 1
LigandBDBM50230408
Substrate/Competitorn/a
Meas. Tech.ChEMBL_1644840 (CHEMBL3993769)
IC50 50±n/a nM
Citation Iyer, MRCinar, RKatz, AGao, MErdelyi, KJourdan, TCoffey, NJPacher, PKunos, G Design, Synthesis, and Biological Evaluation of Novel, Non-Brain-Penetrant, Hybrid Cannabinoid CB J Med Chem60:1126-1141 (2017) 
 
Cannabinoid receptor 1
Name:Cannabinoid receptor 1
Type:Enzyme
Mol. Mass.:52842.52
Organism:Mus musculus (Mouse)
Description:P47746
Residue:473
BDBM50230408
NameBDBM50230408
Synonyms:CHEMBL4076361
TypeSmall organic molecule
Emp. Form.C24H21Cl2N5O2S
Mol. Mass.514.427
SMILESC\C(N)=N/C(=N\S(=O)(=O)c1ccc(Cl)cc1)/N1CC(C(=N1)c1ccc(Cl)cc1)c1ccccc1