Reaction Details
TargetCannabinoid receptor 1
LigandBDBM50230372
Substrate/Competitorn/a
Meas. Tech.ChEMBL_1644840 (CHEMBL3993769)
IC50 118±n/a nM
Citation Iyer, MRCinar, RKatz, AGao, MErdelyi, KJourdan, TCoffey, NJPacher, PKunos, G Design, Synthesis, and Biological Evaluation of Novel, Non-Brain-Penetrant, Hybrid Cannabinoid CB J Med Chem60:1126-1141 (2017) 
 
Cannabinoid receptor 1
Name:Cannabinoid receptor 1
Type:Enzyme
Mol. Mass.:52842.52
Organism:Mus musculus (Mouse)
Description:P47746
Residue:473
BDBM50230372
NameBDBM50230372
Synonyms:CHEMBL4080203
TypeSmall organic molecule
Emp. Form.C28H24ClN5O2S
Mol. Mass.530.04
SMILESC\C(N)=N/C(=N\S(=O)(=O)c1ccc2ccccc2c1)/N1CC(C(=N1)c1ccc(Cl)cc1)c1ccccc1