Reaction Details
TargetCannabinoid receptor 2
LigandBDBM50230406
Substrate/Competitorn/a
Meas. Tech.ChEMBL_1644841 (CHEMBL3993770)
Ki>1000±n/a nM
Citation Iyer, MRCinar, RKatz, AGao, MErdelyi, KJourdan, TCoffey, NJPacher, PKunos, G Design, Synthesis, and Biological Evaluation of Novel, Non-Brain-Penetrant, Hybrid Cannabinoid CB J Med Chem60:1126-1141 (2017) 
 
Cannabinoid receptor 2
Name:Cannabinoid receptor 2
Type:Enzyme Catalytic Domain
Mol. Mass.:38220.43
Organism:MOUSE
Description:P47936
Residue:347
BDBM50230406
NameBDBM50230406
Synonyms:CHEMBL4077774
TypeSmall organic molecule
Emp. Form.C24H21ClIN5O2S2
Mol. Mass.637.943
SMILESCS\C(N)=N/C(=N\S(=O)(=O)c1ccc(I)cc1)/N1CC(C(=N1)c1ccc(Cl)cc1)c1ccccc1