Reaction Details
TargetCannabinoid receptor 1
LigandBDBM50230405
Substrate/Competitorn/a
Meas. Tech.ChEMBL_1644840 (CHEMBL3993769)
IC50 125±n/a nM
Citation Iyer, MRCinar, RKatz, AGao, MErdelyi, KJourdan, TCoffey, NJPacher, PKunos, G Design, Synthesis, and Biological Evaluation of Novel, Non-Brain-Penetrant, Hybrid Cannabinoid CB J Med Chem60:1126-1141 (2017) 
 
Cannabinoid receptor 1
Name:Cannabinoid receptor 1
Type:Enzyme
Mol. Mass.:52842.52
Organism:Mus musculus (Mouse)
Description:P47746
Residue:473
BDBM50230405
NameBDBM50230405
Synonyms:CHEMBL4068077
TypeSmall organic molecule
Emp. Form.C30H25Cl2N5O3S
Mol. Mass.606.522
SMILESN\C(COc1ccccc1)=N\C(=N/S(=O)(=O)c1ccc(Cl)cc1)\N1CC(C(=N1)c1ccc(Cl)cc1)c1ccccc1