Reaction Details
TargetSialic acid-binding Ig-like lectin 7
LigandBDBM50230647
Substrate/Competitorn/a
Meas. Tech.ChEMBL_1644943 (CHEMBL3993872)
IC50 230000±n/a nM
Citation Prescher, HFrank, MGütgemann, SKuhfeldt, ESchweizer, ANitschke, LWatzl, CBrossmer, R Design, Synthesis, and Biological Evaluation of Small, High-Affinity Siglec-7 Ligands: Toward Novel Inhibitors of Cancer Immune Evasion. J Med Chem60:941-956 (2017) 
 
Sialic acid-binding Ig-like lectin 7
Name:Sialic acid-binding Ig-like lectin 7
Type:PROTEIN
Mol. Mass.:51147.68
Organism:Homo sapiens (Human)
Description:ChEMBL_109858
Residue:467
BDBM50230647
NameBDBM50230647
Synonyms:CHEMBL4096201
TypeSmall organic molecule
Emp. Form.C30H38N5NaO10S
Mol. Mass.683.705
SMILES[Na+].[H][C@]1(O[C@@](C[C@H](O)[C@H]1NC(C)=O)(OCCCn1cc(nn1)-c1ccc(cc1)-c1ccccc1)C([O-])=O)[C@H](O)[C@H](O)CNS(=O)(=O)CC