Reaction Details
TargetSialic acid-binding Ig-like lectin 7
LigandBDBM50230648
Substrate/Competitorn/a
Meas. Tech.ChEMBL_1644943 (CHEMBL3993872)
IC50 36900000±n/a nM
Citation Prescher, HFrank, MGütgemann, SKuhfeldt, ESchweizer, ANitschke, LWatzl, CBrossmer, R Design, Synthesis, and Biological Evaluation of Small, High-Affinity Siglec-7 Ligands: Toward Novel Inhibitors of Cancer Immune Evasion. J Med Chem60:941-956 (2017) 
 
Sialic acid-binding Ig-like lectin 7
Name:Sialic acid-binding Ig-like lectin 7
Type:PROTEIN
Mol. Mass.:51147.68
Organism:Homo sapiens (Human)
Description:ChEMBL_109858
Residue:467
BDBM50230648
NameBDBM50230648
Synonyms:CHEMBL3764379
TypeSmall organic molecule
Emp. Form.C23H39NO19
Mol. Mass.633.5511
SMILES[H][C@@]1(O[C@H]2[C@H](O)[C@@H](O)[C@H](O)O[C@@H]2CO)O[C@H](CO)[C@H](O)[C@H](O[C@@]2(C[C@H](O)[C@@H](NC(C)=O)[C@@]([H])(O2)[C@H](O)[C@H](O)CO)C(O)=O)[C@H]1O