Reaction Details
TargetCarbonic anhydrase 4
LigandBDBM50230939
Substrate/Competitorn/a
Meas. Tech.ChEMBL_1644987 (CHEMBL3993916)
Ki 4±n/a nM
Citation Eldehna, WMAl-Ansary, GHBua, SNocentini, AGratteri, PAltoukhy, AGhabbour, HAhmed, HYSupuran, CT Novel indolin-2-one-based sulfonamides as carbonic anhydrase inhibitors: Synthesis, in vitro biological evaluation against carbonic anhydrases isoforms I, II, IV and VII and molecular docking studies. Eur J Med Chem127:521-530 (2017) 
 
Carbonic anhydrase 4
Name:Carbonic anhydrase 4
Type:Enzyme
Mol. Mass.:35037.98
Organism:Homo sapiens (Human)
Description:P22748
Residue:312
BDBM50230939
NameBDBM50230939
Synonyms:CHEMBL4067135
TypeSmall organic molecule
Emp. Form.C17H17N3O3S
Mol. Mass.343.4
SMILESCc1ccc2NC(=O)\C(=N/CCc3ccc(cc3)S(N)(=O)=O)c2c1