Reaction Details
TargetMelatonin receptor type 1B
LigandBDBM50230969
Substrate/Competitorn/a
Meas. Tech.ChEMBL_1645058 (CHEMBL3993987)
Ki 0.500000±n/a nM
Citation Landagaray, EEttaoussi, MRami, MBoutin, JACaignard, DHDelagrange, PMelnyk, PBerthelot, PYous, S New quinolinic derivatives as melatonergic ligands: Synthesis and pharmacological evaluation. Eur J Med Chem127:621-631 (2017) 
 
Melatonin receptor type 1B
Name:Melatonin receptor type 1B
Type:Enzyme
Mol. Mass.:40203.54
Organism:Homo sapiens (Human)
Description:P49286
Residue:362
BDBM50230969
NameBDBM50230969
Synonyms:CHEMBL4070527
TypeSmall organic molecule
Emp. Form.C16H18N2O2
Mol. Mass.270.3263
SMILESCOc1ccc2cccc(CCC(=O)NC3CC3)c2n1