Reaction Details
TargetApoptosis regulator Bcl-2
LigandBDBM50231393
Substrate/Competitorn/a
Meas. Tech.ChEMBL_1645327 (CHEMBL3994256)
Ki 260±n/a nM
Citation Liu, TWan, YLiu, RMa, LLi, MFang, H Design, synthesis and preliminary biological evaluation of indole-3-carboxylic acid-based skeleton of Bcl-2/Mcl-1 dual inhibitors. Bioorg Med Chem25:1939-1948 (2017) 
 
Apoptosis regulator Bcl-2
Name:Apoptosis regulator Bcl-2
Type:Homodimer or heterodimer
Mol. Mass.:26269.11
Organism:Homo sapiens (Human)
Description:P10415
Residue:239
BDBM50231393
NameBDBM50231393
Synonyms:CHEMBL4073167
TypeSmall organic molecule
Emp. Form.C37H28Cl2N4O6S
Mol. Mass.727.612
SMILES[O-][N+](=O)c1cc(ccc1Cl)S(=O)(=O)NC(=O)[C@H](Cc1ccccc1)NC(=O)c1cn(Cc2ccc(cc2)-c2ccc(Cl)cc2)c2ccccc12