Reaction Details
TargetAdenosine receptor A1
LigandBDBM50231588
Substrate/Competitorn/a
Meas. Tech.ChEMBL_1645467 (CHEMBL3994396)
Ki 5.9±n/a nM
Citation Koul, SRamdas, VBarawkar, DAWaman, YBPrasad, NMadadi, SKShejul, YDBonagiri, RBasu, SMenon, SReddy, SBChaturvedi, SChennamaneni, SRBedse, GThakare, RGundu, JChaudhary, SDe, SMeru, AVPalle, VChugh, AMookhtiar, KA Design and synthesis of novel, potent and selective hypoxanthine analogs as adenosine A Bioorg Med Chem25:1963-1975 (2017) 
 
Adenosine receptor A1
Name:Adenosine receptor A1
Type:G Protein-Coupled Receptor (GPCR)
Mol. Mass.:36520.92
Organism:Homo sapiens (Human)
Description:P30542
Residue:326
BDBM50231588
NameBDBM50231588
Synonyms:CHEMBL4084453
TypeSmall organic molecule
Emp. Form.C20H21F3N4O2
Mol. Mass.406.4015
SMILESCCCn1c(Oc2cccc(c2)C(F)(F)F)nc2nc([nH]c2c1=O)C1CCCC1