Reaction Details
TargetAdenosine receptor A2b
LigandBDBM50231590
Substrate/Competitorn/a
Meas. Tech.ChEMBL_1645470 (CHEMBL3994399)
Ki 560±n/a nM
Citation Koul, SRamdas, VBarawkar, DAWaman, YBPrasad, NMadadi, SKShejul, YDBonagiri, RBasu, SMenon, SReddy, SBChaturvedi, SChennamaneni, SRBedse, GThakare, RGundu, JChaudhary, SDe, SMeru, AVPalle, VChugh, AMookhtiar, KA Design and synthesis of novel, potent and selective hypoxanthine analogs as adenosine A Bioorg Med Chem25:1963-1975 (2017) 
 
Adenosine receptor A2b
Name:Adenosine receptor A2b
Type:G Protein-Coupled Receptor (GPCR)
Mol. Mass.:36341.22
Organism:Homo sapiens (Human)
Description:n/a
Residue:332
BDBM50231590
NameBDBM50231590
Synonyms:CHEMBL4063997
TypeSmall organic molecule
Emp. Form.C19H23N5O2
Mol. Mass.353.4182
SMILESCCCn1c(Oc2cccnc2C)nc2nc([nH]c2c1=O)C1CCCC1