Reaction Details
TargetAdenosine receptor A2b
LigandBDBM50231594
Substrate/Competitorn/a
Meas. Tech.ChEMBL_1645470 (CHEMBL3994399)
Ki 650±n/a nM
Citation Koul, SRamdas, VBarawkar, DAWaman, YBPrasad, NMadadi, SKShejul, YDBonagiri, RBasu, SMenon, SReddy, SBChaturvedi, SChennamaneni, SRBedse, GThakare, RGundu, JChaudhary, SDe, SMeru, AVPalle, VChugh, AMookhtiar, KA Design and synthesis of novel, potent and selective hypoxanthine analogs as adenosine A Bioorg Med Chem25:1963-1975 (2017) 
 
Adenosine receptor A2b
Name:Adenosine receptor A2b
Type:G Protein-Coupled Receptor (GPCR)
Mol. Mass.:36341.22
Organism:Homo sapiens (Human)
Description:n/a
Residue:332
BDBM50231594
NameBDBM50231594
Synonyms:CHEMBL4065762
TypeSmall organic molecule
Emp. Form.C20H24N4O2
Mol. Mass.352.4302
SMILESCCCn1c(nc2nc([nH]c2c1=O)C1CCCC1)-c1cccc(OC)c1