Reaction Details
TargetPolycomb protein EED
LigandBDBM50231841
Substrate/Competitorn/a
Meas. Tech.ChEMBL_1645615 (CHEMBL3994544)
IC50 40±n/a nM
Citation Baranczak, ATu, NPMarjanovic, JSearle, PAVasudevan, ADjuric, SW Integrated Platform for Expedited Synthesis-Purification-Testing of Small Molecule Libraries. ACS Med Chem Lett8:461-465 (2017) 
 
Polycomb protein EED
Name:Polycomb protein EED
Type:Protein
Mol. Mass.:50201.68
Organism:Homo sapiens (Human)
Description:O75530
Residue:441
BDBM50231841
NameBDBM50231841
Synonyms:CHEMBL4093192
TypeSmall organic molecule
Emp. Form.C29H40FN5O
Mol. Mass.493.6592
SMILESCN(C)[C@H]1CN(Cc2c(C)cccc2F)C[C@@H]1c1ccc(cc1)N1CCN(CC1)C(=O)N1CCCC1