Reaction Details
TargetPolycomb protein EED
LigandBDBM50231835
Substrate/Competitorn/a
Meas. Tech.ChEMBL_1645614 (CHEMBL3994543)
IC50 50±n/a nM
Citation Baranczak, ATu, NPMarjanovic, JSearle, PAVasudevan, ADjuric, SW Integrated Platform for Expedited Synthesis-Purification-Testing of Small Molecule Libraries. ACS Med Chem Lett8:461-465 (2017) 
 
Polycomb protein EED
Name:Polycomb protein EED
Type:Protein
Mol. Mass.:50201.68
Organism:Homo sapiens (Human)
Description:O75530
Residue:441
BDBM50231835
NameBDBM50231835
Synonyms:CHEMBL4071195
TypeSmall organic molecule
Emp. Form.C30H37FN4
Mol. Mass.472.64
SMILESCN(C)[C@H]1CN(Cc2c(C)cccc2F)C[C@@H]1c1ccc(cc1)N1CCN(CC1)c1ccccc1