Reaction Details
TargetGlucagon-like peptide 1 receptor
LigandBDBM50261506
Substrate/Competitorn/a
Meas. Tech.ChEBML_1645789
Ki 0.320000±n/a nM
Citation Plisson, FHill, TAMitchell, JMHoang, HNde Araujo, ADXu, WCotterell, AEdmonds, DJStanton, RVDerksen, DRLoria, PMGriffith, DAPrice, DALiras, SFairlie, DP Helixconstraints and amino acid substitution in GLP-1 increase cAMP and insulin secretion but not beta-arrestin 2 signaling. Eur J Med Chem127:703-714 (2017) 
 
Glucagon-like peptide 1 receptor
Name:Glucagon-like peptide 1 receptor
Type:Enzyme
Mol. Mass.:53035.78
Organism:Homo sapiens (Human)
Description:P43220
Residue:463
BDBM50261506
NameBDBM50261506
Synonyms:CHEMBL499930 | HAEGTFTSDVSSYLEGQAAKEFIAWLVKGRG-NH2
TypeSmall organic molecule
Emp. Form.C151H229N41O46
Mol. Mass.3354.6811
SMILESCC[C@H](C)[C@H](NC(=O)[C@H](Cc1ccccc1)NC(=O)[C@H](CCC(O)=O)NC(=O)[C@H](CCCCN)NC(=O)[C@H](C)NC(=O)[C@H](C)NC(=O)[C@H](CCC(N)=O)NC(=O)CNC(=O)[C@H](CCC(O)=O)NC(=O)[C@H](CC(C)C)NC(=O)[C@H](Cc1ccc(O)cc1)NC(=O)[C@H](CO)NC(=O)[C@H](CO)NC(=O)[C@@H](NC(=O)[C@H](CC(O)=O)NC(=O)[C@H](CO)NC(=O)[C@@H](NC(=O)[C@H](Cc1ccccc1)NC(=O)[C@@H](NC(=O)CNC(=O)[C@H](CCC(O)=O)NC(=O)[C@H](C)NC(=O)[C@@H](N)Cc1cnc[nH]1)[C@@H](C)O)[C@@H](C)O)C(C)C)C(=O)N[C@@H](C)C(=O)N[C@@H](Cc1c[nH]c2ccccc12)C(=O)N[C@@H](CC(C)C)C(=O)N[C@@H](C(C)C)C(=O)N[C@@H](CCCCN)C(=O)NCC(=O)N[C@@H](CCCNC(N)=N)C(=O)NCC(N)=O