Reaction Details
TargetGlucagon-like peptide 1 receptor
LigandBDBM50231944
Substrate/Competitorn/a
Meas. Tech.ChEMBL_1645789 (CHEMBL3994845)
EC50 150±n/a nM
Citation Plisson, FHill, TAMitchell, JMHoang, HNde Araujo, ADXu, WCotterell, AEdmonds, DJStanton, RVDerksen, DRLoria, PMGriffith, DAPrice, DALiras, SFairlie, DP Helixconstraints and amino acid substitution in GLP-1 increase cAMP and insulin secretion but not beta-arrestin 2 signaling. Eur J Med Chem127:703-714 (2017) 
 
Glucagon-like peptide 1 receptor
Name:Glucagon-like peptide 1 receptor
Type:Enzyme
Mol. Mass.:53035.78
Organism:Homo sapiens (Human)
Description:P43220
Residue:463
BDBM50231944
NameBDBM50231944
Synonyms:CHEMBL4072398
TypeSmall organic molecule
Emp. Form.C151H227N41O45
Mol. Mass.3336.6658
SMILESCC[C@H](C)[C@H](NC(=O)[C@H](Cc1ccccc1)NC(=O)[C@H](CCC(O)=O)NC(=O)[C@H](CCCCN)NC(=O)[C@H](C)NC(=O)[C@H](C)NC(=O)[C@H](CCC(N)=O)NC(=O)CNC(=O)[C@H](CCC(O)=O)NC(=O)[C@H](CC(C)C)NC(=O)[C@H](Cc1ccc(O)cc1)NC(=O)[C@H](CO)NC(=O)[C@H](CO)NC(=O)[C@@H](NC(=O)[C@H](CC(O)=O)NC(=O)[C@H](CO)NC(=O)[C@@H](NC(=O)[C@H](Cc1ccccc1)NC(=O)[C@@H](NC(=O)CNC(=O)[C@@H]1CCC(=O)N[C@@H](Cc2cnc[nH]2)C(=O)N[C@@H](C)C(=O)N1)[C@@H](C)O)[C@@H](C)O)C(C)C)C(=O)N[C@@H](C)C(=O)N[C@@H](Cc1c[nH]c2ccccc12)C(=O)N[C@@H](CC(C)C)C(=O)N[C@@H](C(C)C)C(=O)N[C@@H](CCCCN)C(=O)NCC(=O)N[C@@H](CCCNC(N)=N)C(=O)NCC(N)=O