Reaction Details
TargetGlucagon-like peptide 1 receptor
LigandBDBM50231886
Substrate/Competitorn/a
Meas. Tech.ChEBML_1645791
EC50 50±n/a nM
Citation Plisson, FHill, TAMitchell, JMHoang, HNde Araujo, ADXu, WCotterell, AEdmonds, DJStanton, RVDerksen, DRLoria, PMGriffith, DAPrice, DALiras, SFairlie, DP Helixconstraints and amino acid substitution in GLP-1 increase cAMP and insulin secretion but not beta-arrestin 2 signaling. Eur J Med Chem127:703-714 (2017) 
 
Glucagon-like peptide 1 receptor
Name:Glucagon-like peptide 1 receptor
Type:PROTEIN
Mol. Mass.:52889.73
Organism:Rattus norvegicus
Description:ChEMBL_855307
Residue:463
BDBM50231886
NameBDBM50231886
Synonyms:CHEMBL4070761
TypeSmall organic molecule
Emp. Form.C155H234N42O45
Mol. Mass.3405.7709
SMILESCC[C@H](C)[C@H](NC(=O)[C@H](Cc1ccccc1)NC(=O)[C@H](CCC(O)=O)NC(=O)[C@H](CCCCN)NC(=O)[C@H](C)NC(=O)[C@H](C)NC(=O)[C@H](CCC(N)=O)NC(=O)CNC(=O)[C@H](CCC(O)=O)NC(=O)[C@H](CC(C)C)NC(=O)[C@H](Cc1ccc(O)cc1)NC(=O)[C@@H]1CC(=O)NCCCC[C@H](NC(=O)[C@@H](NC(=O)[C@H](Cc2ccccc2)NC(=O)[C@@H](NC(=O)CNC(=O)[C@H](CCC(O)=O)NC(=O)[C@H](C)NC(=O)[C@@H](N)Cc2cnc[nH]2)[C@@H](C)O)[C@@H](C)O)C(=O)N[C@@H](CC(O)=O)C(=O)N[C@@H](C(C)C)C(=O)N[C@@H](CO)C(=O)N1)C(=O)N[C@@H](C)C(=O)N[C@@H](Cc1c[nH]c2ccccc12)C(=O)N[C@@H](CC(C)C)C(=O)N[C@@H](C(C)C)C(=O)N[C@@H](CCCCN)C(=O)NCC(=O)N[C@@H](CCCNC(N)=N)C(=O)NCC(N)=O