Reaction Details
TargetPolyunsaturated fatty acid 5-lipoxygenase
LigandBDBM50231993
Substrate/Competitorn/a
Meas. Tech.ChEMBL_1645815 (CHEMBL3994871)
IC50 200±n/a nM
Citation Peduto, AScuotto, MKrauth, VRoviezzo, FRossi, ATemml, VEsposito, VStuppner, HSchuster, DD'Agostino, BSchiraldi, Cde Rosa, MWerz, OFilosa, R Optimization of benzoquinone and hydroquinone derivatives as potent inhibitors of human 5-lipoxygenase. Eur J Med Chem127:715-726 (2017) 
 
Polyunsaturated fatty acid 5-lipoxygenase
Name:Polyunsaturated fatty acid 5-lipoxygenase
Type:Enzyme
Mol. Mass.:77972.74
Organism:Homo sapiens (Human)
Description:Recombinant protein was purified from E. coli lysate. After ammonium sulfate precipitation and subsequent steps, the supernatant (S100) was used for 5-LO activity assay.
Residue:674
BDBM50231993
NameBDBM50231993
Synonyms:CHEMBL4088278
TypeSmall organic molecule
Emp. Form.C19H30O5
Mol. Mass.338.4385
SMILESCOC1=CC(=O)C(OC)=C(CCCCCCCCCCCO)C1=O