Reaction Details
TargetPolyunsaturated fatty acid 5-lipoxygenase
LigandBDBM50231999
Substrate/Competitorn/a
Meas. Tech.ChEMBL_1645815 (CHEMBL3994871)
IC50 90±n/a nM
Citation Peduto, AScuotto, MKrauth, VRoviezzo, FRossi, ATemml, VEsposito, VStuppner, HSchuster, DD'Agostino, BSchiraldi, Cde Rosa, MWerz, OFilosa, R Optimization of benzoquinone and hydroquinone derivatives as potent inhibitors of human 5-lipoxygenase. Eur J Med Chem127:715-726 (2017) 
 
Polyunsaturated fatty acid 5-lipoxygenase
Name:Polyunsaturated fatty acid 5-lipoxygenase
Type:Enzyme
Mol. Mass.:77972.74
Organism:Homo sapiens (Human)
Description:Recombinant protein was purified from E. coli lysate. After ammonium sulfate precipitation and subsequent steps, the supernatant (S100) was used for 5-LO activity assay.
Residue:674
BDBM50231999
NameBDBM50231999
Synonyms:CHEMBL4103758
TypeSmall organic molecule
Emp. Form.C20H34O4
Mol. Mass.338.4816
SMILESCCCCCCCCCCCCc1c(O)c(O)cc(OC)c1OC