Reaction Details
Target17-beta-hydroxysteroid dehydrogenase type 1
LigandBDBM50232175
Substrate/Competitorn/a
Meas. Tech.ChEMBL_1646098 (CHEMBL3995154)
IC50 2.1±n/a nM
Citation Abdelsamie, ASvan Koppen, CJBey, ESalah, MBörger, CSiebenbürger, LLaschke, MWMenger, MDFrotscher, M Treatment of estrogen-dependent diseases: Design, synthesis and profiling of a selective 17ß-HSD1 inhibitor with sub-nanomolar IC Eur J Med Chem127:944-957 (2017) 
 
17-beta-hydroxysteroid dehydrogenase type 1
Name:17-beta-hydroxysteroid dehydrogenase type 1
Type:Enzyme
Mol. Mass.:34945.13
Organism:Homo sapiens (Human)
Description:P14061
Residue:328
BDBM50232175
NameBDBM50232175
Synonyms:CHEMBL4060257
TypeSmall organic molecule
Emp. Form.C24H21ClF2N2O4S
Mol. Mass.506.949
SMILESCC(=O)N1CCN(Cc2cc(cc(Cl)c2O)-c2ccc(s2)C(=O)c2c(F)ccc(O)c2F)CC1